{"text_format":"1","workbook":"xlsx","n_sheets":10,"sheets":["Couverture","Mur","Toit plat","Toit monopente","Toit à deux versants","Toit à deux versants V","Toit en pavillon","Auvent","W_daten","Explication"],"not_rendered":{"charts":0,"images":3,"macros":1,"external_links":0,"defined_names":10,"comments":0,"pivot_tables":0},"unopened":[],"bounds":{"document_bytes":16777216,"sheet_cells":100000,"rows_first":2000,"rows_last":500,"rows_between":2000,"halvings":0,"cell_chars":16384,"cell_head_chars":4096},"cells_cut":0,"cells_raw":0,"read":"whole","date_system":"1900"}

{"sheet":"Couverture","index":0,"n_rows":42,"n_cols":5,"rows_kept":42,"cut":false,"hidden":false,"merged":[]}
[]
[]
[]
[]
[]
[]
[null,"Projet:","B2B "]
[null,"Numero de projet: 2026"]
[]
[]
[]
[null,"Adresse:"]
[]
[null,"…"]
[null,"…"]
[null,"…"]
[]
[]
[]
[]
{"$rows_left_out":23}
{"sheet":"Mur","index":1,"n_rows":58,"n_cols":15,"rows_kept":58,"cut":false,"hidden":false,"merged":[]}
[]
["Vent:"]
[]
["Ce chapitre présente le calcul de l’action du vent sur un mur conformément aux ",null,null,null,null,null,null,null,null,"Pays","Allemagne",null,null,"h",24]
["prescriptions de l’Eurocode 1 (EN 1991-1-4), relatif aux actions du vent sur les structures. ",null,null,null,null,null,null,null,null,"Zone",1,"Binnenland",null,"b",6]
["L’étude porte sur un bâtiment de hauteur inférieure à   25 mètres, ce qui permet l’application des ",null,null,null,null,null,null,null,null,"Terrain","urbain dense",null,null,"l",10]
["méthodes simplifiées. Les coefficients aérodynamiques sont déterminés en fonction  de la "]
["géométrie du bâtiment, de la Les pressions caractéristiques du vent sont ensuite calculées à"]
["l’aide de la pression de base du vent et des coefficients Cpe permettant une évaluation précise "]
["des efforts transmis à la structure. La valeur de base de la vitesse du vent est déterminée"]
["conformément à la zone définie par la réglementation locale."]
["Valeur de base de la vitesse du vent",null,null,{"$f":"IF(K4=\"Allemagne\",VLOOKUP(Mur!K5,W_daten!A4:C7,2,FALSE),\nIF(K4=\"Maroc\",VLOOKUP(Mur!K5,W_daten!I3:L7,2,FALSE),\"\"))","v":22.5},"kN/m²"]
["Pression dynamique de base :",null,{"$f":"IF(K4=\"Allemagne\",VLOOKUP(Mur!K5,W_daten!A4:C7,3,FALSE),\nIF(K4=\"Maroc\",VLOOKUP(Mur!K5,W_daten!I3:L7,3,FALSE),\"\"))","v":0.32},"kN/m²"]
[]
["Les dimensions du bâtiment"]
[]
["Hauteur du bâtiment:",null,{"$f":"O4","v":24}]
["Largeur du bâtiment:",null,{"$f":"O5","v":6}]
["Longuer du bâtiment:   ",null,{"$f":"O6","v":10}]
[]
{"$rows_left_out":39}
{"sheet":"Toit plat","index":2,"n_rows":47,"n_cols":15,"rows_kept":47,"cut":false,"hidden":false,"merged":[]}
[]
["Vent:"]
[]
["Ce chapitre présente le calcul de l’action du vent sur une toiture plate conformément aux prescriptions de ",null,null,null,null,null,null,null,null,"Pays","Allemagne",null,null,"d",4]
["l’Eurocode 1 (EN 1991-1-4), relatif aux actions du vent sur les structures. L’étude porte sur un bâtiment ",null,null,null,null,null,null,null,null,"Zone",1,"Binnenland",null,"h",12]
["de hauteur inférieure à  25 mètres, ce qui permet l’application des méthodes simplifiées. Les coefficients ",null,null,null,null,null,null,null,null,"Terrain","Semi urbain",null,null,"b",40]
["aérodynamiques sont déterminés en fonction de la géométrie du bâtiment, de la direction du vent, ainsi que "]
["de la répartition des zones de pression sur les parois. Les pressions caractéristiques du vent sont ensuite ",null,null,null,null,null,null,null,null,"Avec ou sans acrotère","avec acrotère",null,null,"NB : J’ai pris en compte dans le calcu juste l la présence ou non d’un acrotère. Vous pouvez développer cela à partir du tableau (qui est déjà prêt)."]
["calculées à l’aide de la pression de base du vent et des coefficients Cpe permettant une évaluation ",null,null,null,null,null,null,null,null,{"$f":"IF(K8=W_daten!Q37,\"rien à ajouter\",\nIF(K8=W_daten!Q38,\"hp en m\",\nIF(K8=W_daten!Q41,\"r\",IF(K8=W_daten!Q44,\"alpha\",\n\"\"))))","v":"hp en m"},2]
["précise des efforts transmis à la structure par la toiture. "]
["La valeur de base de la vitesse du vent est déterminée conformément à la zone définie "]
["Valeur de base de la vitesse du vent",null,null,{"$f":"IF(K4=\"Allemagne\",VLOOKUP('Toit plat'!K5,W_daten!A4:C7,2,FALSE),\nIF(K4=\"Maroc\",VLOOKUP('Toit plat'!K5,W_daten!I3:L7,2,FALSE),\"\"))","v":22.5},"kN/m²"]
["Pression dynamique de base :",null,{"$f":"IF(K4=\"Allemagne\",VLOOKUP('Toit plat'!K5,W_daten!A4:C7,3,FALSE),\nIF(K4=\"Maroc\",VLOOKUP('Toit plat'!K5,W_daten!I3:L7,3,FALSE),\"\"))","v":0.32},"kN/m²"]
[]
["Les dimensions du bâtiment"]
[]
["Hauteur du bâtiment:",null,{"$f":"O5","v":12}]
["Largeur du bâtiment:",null,{"$f":"O4","v":4}]
["Longuer du bâtiment:   ",null,{"$f":"O6","v":40}]
[]
{"$rows_left_out":28}
{"sheet":"Toit monopente","index":3,"n_rows":88,"n_cols":15,"rows_kept":88,"cut":false,"hidden":false,"merged":[]}
[]
["Vent:"]
[]
["Ce chapitre présente le calcul de l’action du vent sur une toiture monopente conformément aux prescriptions de ",null,null,null,null,null,null,null,null,"Pays","Allemagne",null,null,"h",18]
["l’Eurocode 1 (EN 1991-1-4), relatif aux actions du vent sur les structures. L’étude porte sur un bâtiment ",null,null,null,null,null,null,null,null,"Zone",3,"Binnenland",null,"d",12]
["de hauteur inférieure à  25 mètres, ce qui permet l’application des méthodes simplifiées. Les coefficients ",null,null,null,null,null,null,null,null,"Terrain","Semi urbain",null,null,"b",40]
["aérodynamiques sont déterminés en fonction de la géométrie du bâtiment, de la direction du vent, ainsi que "]
["de la répartition des zones de pression sur les parois. Les pressions caractéristiques du vent sont ensuite "]
["calculées à l’aide de la pression de base du vent et des coefficients Cpe permettant une évaluation ",null,null,null,null,null,null,null,null,"alpha",15]
["précise des efforts transmis à la structure par la toiture. "]
["La valeur de base de la vitesse du vent est déterminée conformément à la zone définie "]
["Valeur de base de la vitesse du vent",null,null,{"$f":"IF(K4=\"Allemagne\",VLOOKUP('Toit monopente'!K5,W_daten!A4:C7,2,FALSE),\nIF(K4=\"Maroc\",VLOOKUP('Toit monopente'!K5,W_daten!I3:L7,2,FALSE),\"\"))","v":27.5},"kN/m²"]
["Pression dynamique de base :",null,{"$f":"IF(K4=\"Allemagne\",VLOOKUP('Toit monopente'!K5,W_daten!A4:C7,3,FALSE),\nIF(K4=\"Maroc\",VLOOKUP('Toit monopente'!K5,W_daten!I3:L7,3,FALSE),\"\"))","v":0.47},"kN/m²"]
[]
["Les dimensions du bâtiment"]
[]
["Hauteur du bâtiment:",null,{"$f":"O4","v":18}]
["Largeur du bâtiment:",null,{"$f":"O5","v":12}]
["Longuer du bâtiment:   ",null,{"$f":"O6","v":40}]
[]
{"$rows_left_out":69}
{"sheet":"Toit à deux versants","index":4,"n_rows":80,"n_cols":15,"rows_kept":80,"cut":false,"hidden":false,"merged":[]}
[]
["Vent:"]
[]
["Ce chapitre présente le calcul de l’action du vent sur une toiture à deux versants conformément aux prescriptions de ",null,null,null,null,null,null,null,null,"Pays","Allemagne",null,null,"h",18]
["l’Eurocode 1 (EN 1991-1-4), relatif aux actions du vent sur les structures. L’étude porte sur un bâtiment ",null,null,null,null,null,null,null,null,"Zone",4,"Binnenland",null,"d",12]
["de hauteur inférieure à  25 mètres, ce qui permet l’application des méthodes simplifiées. Les coefficients ",null,null,null,null,null,null,null,null,"Terrain","Semi urbain",null,null,"b",40]
["aérodynamiques sont déterminés en fonction de la géométrie du bâtiment, de la direction du vent, ainsi que "]
["de la répartition des zones de pression sur les parois. Les pressions caractéristiques du vent sont ensuite "]
["calculées à l’aide de la pression de base du vent et des coefficients Cpe permettant une évaluation ",null,null,null,null,null,null,null,null,"alpha",7]
["précise des efforts transmis à la structure par la toiture. "]
["La valeur de base de la vitesse du vent est déterminée conformément à la zone définie "]
["Valeur de base de la vitesse du vent",null,null,{"$f":"IF(K4=\"Allemagne\",VLOOKUP('Toit à deux versants'!K5,W_daten!A4:C7,2,FALSE),\nIF(K4=\"Maroc\",VLOOKUP('Toit à deux versants'!K5,W_daten!I3:L7,2,FALSE),\"\"))","v":30},"kN/m²"]
["Pression dynamique de base :",null,{"$f":"IF(K4=\"Allemagne\",VLOOKUP('Toit à deux versants'!K5,W_daten!A4:C7,3,FALSE),\nIF(K4=\"Maroc\",VLOOKUP('Toit à deux versants'!K5,W_daten!I3:L7,3,FALSE),\"\"))","v":0.56000000000000005},"kN/m²"]
[]
["Les dimensions du bâtiment"]
[]
["Hauteur du bâtiment:",null,{"$f":"O4","v":18}]
["Largeur du bâtiment:",null,{"$f":"O5","v":12}]
["Longuer du bâtiment:   ",null,{"$f":"O6","v":40}]
[]
{"$rows_left_out":61}
{"sheet":"Toit à deux versants V","index":5,"n_rows":58,"n_cols":15,"rows_kept":58,"cut":false,"hidden":false,"merged":[]}
[]
["Vent:"]
[]
["Ce chapitre présente le calcul de l’action du vent sur une toiture  à deux versants conformément aux prescriptions de ",null,null,null,null,null,null,null,null,"Pays","Maroc",null,null,"h",18]
["l’Eurocode 1 (EN 1991-1-4), relatif aux actions du vent sur les structures. L’étude porte sur un bâtiment ",null,null,null,null,null,null,null,null,"Zone",2,"Binnenland",null,"d",12]
["de hauteur inférieure à  25 mètres, ce qui permet l’application des méthodes simplifiées. Les coefficients ",null,null,null,null,null,null,null,null,"Terrain","Semi urbain",null,null,"b",40]
["aérodynamiques sont déterminés en fonction de la géométrie du bâtiment, de la direction du vent, ainsi que "]
["de la répartition des zones de pression sur les parois. Les pressions caractéristiques du vent sont ensuite "]
["calculées à l’aide de la pression de base du vent et des coefficients Cpe permettant une évaluation ",null,null,null,null,null,null,null,null,"alpha",-12]
["précise des efforts transmis à la structure par la toiture. "]
["La valeur de base de la vitesse du vent est déterminée conformément à la zone définie "]
["Valeur de base de la vitesse du vent",null,null,{"$f":"IF(K4=\"Allemagne\",VLOOKUP('Toit à deux versants V'!K5,W_daten!A4:C7,2,FALSE),\nIF(K4=\"Maroc\",VLOOKUP('Toit à deux versants V'!K5,W_daten!I3:L7,2,FALSE),\"\"))","v":41.5},"kN/m²"]
["Pression dynamique de base :",null,{"$f":"IF(K4=\"Allemagne\",VLOOKUP('Toit à deux versants V'!K5,W_daten!A4:C7,3,FALSE),\nIF(K4=\"Maroc\",VLOOKUP('Toit à deux versants V'!K5,W_daten!I3:L7,3,FALSE),\"\"))","v":1.08},"kN/m²"]
[]
["Les dimensions du bâtiment"]
[]
["Hauteur du bâtiment:",null,{"$f":"O4","v":18}]
["Largeur du bâtiment:",null,{"$f":"O5","v":12}]
["Longuer du bâtiment:   ",null,{"$f":"O6","v":40}]
[]
{"$rows_left_out":39}
{"sheet":"Toit en pavillon","index":6,"n_rows":62,"n_cols":15,"rows_kept":62,"cut":false,"hidden":false,"merged":[]}
[]
["Vent:"]
[]
["Ce chapitre présente le calcul de l’action du vent sur une toiture en pavillon conformément aux prescriptions de ",null,null,null,null,null,null,null,null,"Pays","Maroc",null,null,"h",18]
["l’Eurocode 1 (EN 1991-1-4), relatif aux actions du vent sur les structures. L’étude porte sur un bâtiment ",null,null,null,null,null,null,null,null,"Zone",2,"Binnenland",null,"d",12]
["de hauteur inférieure à  25 mètres, ce qui permet l’application des méthodes simplifiées. Les coefficients ",null,null,null,null,null,null,null,null,"Terrain","Semi urbain",null,null,"b",40]
["aérodynamiques sont déterminés en fonction de la géométrie du bâtiment, de la direction du vent, ainsi que "]
["de la répartition des zones de pression sur les parois. Les pressions caractéristiques du vent sont ensuite "]
["calculées à l’aide de la pression de base du vent et des coefficients Cpe permettant une évaluation ",null,null,null,null,null,null,null,null,"alpha",12]
["précise des efforts transmis à la structure par la toiture. ",null,null,null,null,null,null,null,null,"alpha",13]
["La valeur de base de la vitesse du vent est déterminée conformément à la zone définie "]
["Valeur de base de la vitesse du vent",null,null,{"$f":"IF(K4=\"Allemagne\",VLOOKUP('Toit en pavillon'!K5,W_daten!A4:C7,2,FALSE),\nIF(K4=\"Maroc\",VLOOKUP('Toit en pavillon'!K5,W_daten!I3:L7,2,FALSE),\"\"))","v":41.5},"kN/m²"]
["Pression dynamique de base :",null,{"$f":"IF(K4=\"Allemagne\",VLOOKUP('Toit en pavillon'!K5,W_daten!A4:C7,3,FALSE),\nIF(K4=\"Maroc\",VLOOKUP('Toit en pavillon'!K5,W_daten!I3:L7,3,FALSE),\"\"))","v":1.08},"kN/m²"]
[]
["Les dimensions du bâtiment"]
[]
["Hauteur du bâtiment:",null,{"$f":"O4","v":18}]
["Largeur du bâtiment:",null,{"$f":"O5","v":12}]
["Longuer du bâtiment:   ",null,{"$f":"O6","v":40}]
[]
{"$rows_left_out":43}
{"sheet":"Auvent","index":7,"n_rows":39,"n_cols":15,"rows_kept":39,"cut":false,"hidden":false,"merged":[]}
[]
["Vent:"]
[]
["Ce chapitre présente le calcul de l’action du vent sur une Auvent  conformément aux prescriptions de ",null,null,null,null,null,null,null,null,"Pays","Maroc",null,null,"h",18]
["l’Eurocode 1 (EN 1991-1-4), relatif aux actions du vent sur les structures. L’étude porte sur un bâtiment ",null,null,null,null,null,null,null,null,"Zone",2,"Binnenland",null,"b1",12]
["de hauteur inférieure à  25 mètres, ce qui permet l’application des méthodes simplifiées. Les coefficients ",null,null,null,null,null,null,null,null,"Terrain","Semi urbain",null,null,"l",40]
["aérodynamiques sont déterminés en fonction de la géométrie du bâtiment, de la direction du vent, ainsi que ",null,null,null,null,null,null,null,null,null,null,null,null,"d1",1.5]
["de la répartition des zones de pression sur les parois. Les pressions caractéristiques du vent sont ensuite ",null,null,null,null,null,null,null,null,null,null,null,null,"h1",4]
["calculées à l’aide de la pression de base du vent et des coefficients Cpe permettant une évaluation ",null,null,null,null,null,null,null,null,"alpha",12]
["précise des efforts transmis à la structure par la toiture. "]
["La valeur de base de la vitesse du vent est déterminée conformément à la zone définie "]
["Valeur de base de la vitesse du vent",null,null,{"$f":"IF(K4=\"Allemagne\",VLOOKUP(Auvent!K5,W_daten!A4:C7,2,FALSE),\nIF(K4=\"Maroc\",VLOOKUP(Auvent!K5,W_daten!I3:L7,2,FALSE),\"\"))","v":41.5},"kN/m²"]
["Pression dynamique de base :",null,{"$f":"IF(K4=\"Allemagne\",VLOOKUP(Auvent!K5,W_daten!A4:C7,3,FALSE),\nIF(K4=\"Maroc\",VLOOKUP(Auvent!K5,W_daten!I3:L7,3,FALSE),\"\"))","v":1.08},"kN/m²"]
[]
["Les dimensions du bâtiment",null,null,null,null,null,null,{"$f":"\"h = \"&O4&\"m\"","v":"h = 18m"}]
[null,null,null,null,null,{"$f":"\"d1 = \"&O7&\"m\"","v":"d1 = 1,5m"},{"$f":"\"h1 = \"&O8&\"m\"","v":"h1 = 4m"}]
["Hauteur du bâtiment:",null,{"$f":"O4","v":18}]
["Largeur Auvent:",null,{"$f":"O5","v":12}]
["Longuer Auvent:   ",null,{"$f":"O6","v":40}]
[]
{"$rows_left_out":20}
{"sheet":"W_daten","index":8,"n_rows":181,"n_cols":29,"rows_kept":181,"cut":false,"hidden":false,"merged":[[62,7,62,8],[35,27,38,28],[62,9,62,10],[34,24,34,25],[34,18,34,19],[34,22,34,23],[34,20,34,21],[39,9,39,10],[57,18,57,19],[57,20,57,21],[57,22,57,23],[37,16,39,16],[40,16,42,16],[43,16,45,16],[135,15,135,16],[135,17,135,18],[135,1,135,2],[135,3,135,4],[135,5,135,6],[135,7,135,8],[1,8,1,10],[1,0,1,2],[135,9,135,10],[135,11,135,12],[135,13,135,14],[39,1,39,2],[39,3,39,4],[39,5,39,6],[39,7,39,8],[45,1,45,2],[45,3,45,4],[45,5,45,6],[45,7,45,8],[62,1,62,2],[62,3,62,4],[62,5,62,6]]}
[]
["Allemagne",null,null,null,null,null,null,null,"Maroc"]
["Windzone","vb0 in m/s","qb0 in KN/m²","qb","Semi urbain",null,"Allemagne",null,"Windzone","vb0 in m/s","qb0 in KN/m²","qb",null,"Hauteur","Semi urbain","urbain dense",null,"höhe",{"$f":"'Toit plat'!O5","v":12},{"$f":"IF(S3<=10,\"A\",IF(S3<=18,\"B\",IF(S3<=25,\"C\",\"Außerhalb der Bereiche\")))","v":"B"},{"$f":"'Toit plat'!K5&'Toit plat'!L5","v":"1Binnenland"},{"$f":"INDEX(C11:F18, MATCH(U3, F11:F18, 0), MATCH(T3,C10:F10, 0))","v":0.65},"Toit Plat"]
[1,22.5,0.32,null,"urbain dense",null,"Maroc",null,1,39,{"$f":"ROUND((1/2)*1.25*J4^2*(10^(-3)),2)","v":0.95},null,"A",10,1,0.83,null,null,{"$f":"IF(S3<=10,\"A\",IF(S3<=20,\"B\",IF(S3<=25,\"C\",\"Außerhalb der Bereiche\")))","v":"B"},{"$f":"'Toit plat'!K6","v":"Semi urbain"},{"$f":"INDEX(O4:P7, MATCH(S4,M4:M6, 0), MATCH(T4,O3:P3, 0))","v":1.1599999999999999},{"$f":"U4^2*'Toit plat'!C13","v":0.43059199999999997}]
[2,25,0.39,null,null,null,null,null,2,41.5,{"$f":"ROUND((1/2)*1.25*J5^2*(10^(-3)),2)","v":1.08},null,"B",20,1.1599999999999999,0.96,null,null,null,null,null,{"$f":"ROUND(IF('Toit plat'!K4=\"Allemagne\", V3, IF('Toit plat'!K4=\"Maroc\", V4, FALSE)),2)","v":0.65}]
[3,27.5,0.47,null,null,null,null,null,3,42.3,1.1200000000000001,null,"C",30,1.26,1.04]
[4,30,0.56000000000000005,null,null,null,null,null,4,45,1.27,null,null,40,1.34,1.1000000000000001,null,"höhe",{"$f":"'Toit monopente'!O4","v":18},{"$f":"IF(S7<=10,\"A\",IF(S7<=18,\"B\",IF(S7<=25,\"C\",\"Außerhalb der Bereiche\")))","v":"B"},{"$f":"'Toit monopente'!K5&'Toit monopente'!L5","v":"3Binnenland"},{"$f":"INDEX(C11:F18, MATCH(U7, F11:F18, 0), MATCH(T7, C10:F10, 0))","v":1.2},"Toit monopente"]
["Vereinfachte Böengeschindigkeitsdrücke für Bauwerke bis 25m",null,null,null,null,null,null,null,null,null,null,null,null,null,null,null,null,null,{"$f":"IF(S7<=10,\"A\",IF(S7<=20,\"B\",IF(S7<=25,\"C\",\"Außerhalb der Bereiche\")))","v":"B"},{"$f":"'Toit monopente'!K6","v":"Semi urbain"},{"$f":"INDEX(O4:P7, MATCH(S8,M4:M6, 0), MATCH(T8,O3:P3, 0))","v":1.1599999999999999},{"$f":"U8^2*'Toit monopente'!C13","v":0.63243199999999988}]
[null,null,null,null,null,null,null,null,null,null,null,null,null,null,null,null,null,null,null,null,null,{"$f":"ROUND(IF('Toit monopente'!K4=\"Allemagne\", V7, IF('Toit monopente'!K4=\"Maroc\", V8, FALSE)),2)","v":1.2}]
[null,null,"A","B","C","E"]
[1,"Binnenland",0.5,0.65,0.75,{"$f":"A11&B11","v":"1Binnenland"}]
[2,"Binnenland",0.65,0.8,0.9,{"$f":"A12&B12","v":"2Binnenland"},null,null,null,null,null,null,null,null,null,null,null,"höhe",{"$f":"'Toit à deux versants'!O4","v":18},{"$f":"IF(S12<=10,\"A\",IF(S12<=18,\"B\",IF(S12<=25,\"C\",\"Außerhalb der Bereiche\")))","v":"B"},{"$f":"'Toit à deux versants'!K5&'Toit à deux versants'!L5","v":"4Binnenland"},{"$f":"INDEX(C11:F18, MATCH(U12, F11:F18, 0), MATCH(T12, C10:F10, 0))","v":1.1499999999999999},"Toit a deux versant"]
[2,"Ostseeküste und –inseln",0.85,1,1.1000000000000001,"2Ostseeküste und –inseln",null,"höhe",{"$f":"Mur!C17","v":24},{"$f":"IF(I13<=10,\"A\",IF(I13<=18,\"B\",IF(I13<=25,\"C\",\"Außerhalb der Bereiche\")))","v":"C"},{"$f":"Mur!K5&Mur!L5","v":"1Binnenland"},{"$f":"INDEX(C11:F18, MATCH(K13, F11:F18, 0), MATCH(J13, C10:F10, 0))","v":0.75},"Mur",null,null,null,null,null,{"$f":"IF(S12<=10,\"A\",IF(S12<=20,\"B\",IF(S12<=25,\"C\",\"Außerhalb der Bereiche\")))","v":"B"},{"$f":"'Toit à deux versants'!K6","v":"Semi urbain"},{"$f":"INDEX(O4:P7, MATCH(S13, M4:M6, 0), MATCH(T13, O3:P3, 0))","v":1.1599999999999999},{"$f":"U13^2*'Toit à deux versants'!C13","v":0.75353599999999998}]
[3,"Ostseeküste und –inseln",0.8,0.95,1.1000000000000001,"3Ostseeküste und –inseln",null,null,{"$f":"IF(I13<=10,\"A\",IF(I13<=20,\"B\",IF(I13<=25,\"C\",\"Außerhalb der Bereiche\")))","v":"C"},{"$f":"Mur!K6","v":"urbain dense"},{"$f":"INDEX(O4:P7, MATCH(I14, M4:M6, 0), MATCH(J14, O3:P3, 0))","v":1.04},{"$f":"K14^2*Mur!C13","v":0.34611200000000003},null,null,null,null,null,null,null,null,null,{"$f":"ROUND(IF('Toit à deux versants'!K4=\"Allemagne\", V12, IF('Toit à deux versants'!K4=\"Maroc\", V13, FALSE)),2)","v":1.1499999999999999}]
[3,"Binnenland",1.05,1.2,1.3,"3Binnenland",null,null,null,null,null,{"$f":"ROUND(IF(Mur!K4=\"Allemagne\", L13, IF(Mur!K4=\"Maroc\", L14, FALSE)),2)","v":0.75}]
[4,"Binnenland",0.95,1.1499999999999999,1.3,"4Binnenland"]
[4,"Ostseeküste, Nordseeküste",1.25,1.4,1.55,"4Ostseeküste, Nordseeküste",null,null,null,null,null,null,null,null,null,null,null,"höhe",{"$f":"'Toit à deux versants V'!O4","v":18},{"$f":"IF(S17<=10,\"A\",IF(S17<=18,\"B\",IF(S17<=25,\"C\",\"Außerhalb der Bereiche\")))","v":"B"},{"$f":"'Toit à deux versants V'!K5&'Toit à deux versants V'!L5","v":"2Binnenland"},{"$f":"INDEX(C11:F18, MATCH(U17, F11:F18, 0), MATCH(T17, C10:F10, 0))","v":0.8},"Toit a deux versant V"]
[4,"Nordseeinseln",1.4,"x","x","4Nordseeinseln",null,null,null,null,null,null,null,null,null,null,null,null,{"$f":"IF(S17<=10,\"A\",IF(S17<=20,\"B\",IF(S17<=25,\"C\",\"Außerhalb der Bereiche\")))","v":"B"},{"$f":"'Toit à deux versants V'!K6","v":"Semi urbain"},{"$f":"INDEX(O4:P7, MATCH(S18, M4:M6, 0), MATCH(T18, O3:P3, 0))","v":1.1599999999999999},{"$f":"U18^2*'Toit à deux versants V'!C13","v":1.4532480000000001}]
[null,null,null,null,null,null,null,null,null,null,null,null,null,null,null,null,null,null,null,null,null,{"$f":"ROUND(IF('Toit à deux versants V'!K4=\"Allemagne\", V17, IF('Toit à deux versants V'!K4=\"Maroc\", V18, FALSE)),2)","v":1.45}]
["Erklärung A B C"]
{"$rows_left_out":162}
{"sheet":"Explication","index":9,"n_rows":14,"n_cols":4,"rows_kept":14,"cut":false,"hidden":false,"merged":[]}
[]
[]
[]
[null,"Ce fichier Excel permet le calcul des charges de vent selon l’Eurocode ; il intègre les zones de vent de l’Allemagne comme exemple et a été adapté pour une utilisation au Maroc. "]
[null,"Il s’agit d’un outil simplifié couvrant les cas les plus courants, tandis qu’un autre fichier séparé traitera les situations particulières. "]
[null,"L’utilisateur n’a qu’à remplir les cellules jaunes et choisir entre le Maroc et l’Allemagne, avec la possibilité d’adapter la vitesse du vent et les textes selon ses besoins."]
[]
[]
[]
[]
[]
[]
[]
[null,null,null,"Choix Mroc-Allemagne"]